{"text_format":"1","workbook":"xlsx","n_sheets":3,"sheets":["Formulier","Goede Antwoorden","Export"],"not_rendered":{"charts":0,"images":1,"macros":1,"external_links":0,"defined_names":41,"comments":0,"pivot_tables":0},"unopened":[],"bounds":{"document_bytes":16777216,"sheet_cells":100000,"rows_first":2000,"rows_last":500,"rows_between":2000,"halvings":0,"cell_chars":16384,"cell_head_chars":4096},"cells_cut":0,"cells_raw":0,"read":"whole","date_system":"1900"}

{"sheet":"Formulier","index":0,"n_rows":66,"n_cols":18,"rows_kept":66,"cut":false,"hidden":false,"merged":[[65,13,65,18],[60,15,60,18],[55,15,55,18],[53,15,53,18],[48,15,48,18],[5,3,5,18],[6,3,6,18],[7,3,7,18],[65,5,65,8],[8,3,8,10],[8,11,8,18],[41,5,41,8],[43,5,43,8],[46,5,46,8],[41,15,41,18],[43,15,43,18],[46,15,46,18],[48,5,48,8],[53,5,53,8],[55,5,55,8],[60,5,60,8]]}
[{"$f":"+'Goede Antwoorden'!A1","v":"SVO"}]
[{"$f":"+'Goede Antwoorden'!A2","v":"Euro 2020 Toto"}]
[]
["Deelnameformulier"]
[]
["Naam",null,null," "]
["Telefoon"]
["E-mail"]
["Betaling"]
[]
["Groepswedstrijden"]
["Vrijdag 11 juni 2021",null,null,null,null,null,null,null,null,null,"Vrijdag 18 juni 2021"]
[{"$f":"+'Goede Antwoorden'!I9","v":"21:00:00"},{"$f":"+'Goede Antwoorden'!G9","v":"Rome"},{"$f":"+'Goede Antwoorden'!J9","v":"A"},{"$f":"VLOOKUP('Goede Antwoorden'!A9,Landnamen,2,FALSE)&\" - \"&VLOOKUP('Goede Antwoorden'!C9,Landnamen,2,FALSE)","v":"Turkije - Italië"},null,null,null,"-",null,null,{"$f":"+'Goede Antwoorden'!I27","v":"15:00:00"},{"$f":"+'Goede Antwoorden'!G27","v":"Sint Petersburg"},{"$f":"+'Goede Antwoorden'!J27","v":"E"},{"$f":"VLOOKUP('Goede Antwoorden'!A27,Landnamen,2,FALSE)&\" - \"&VLOOKUP('Goede Antwoorden'!C27,Landnamen,2,FALSE)","v":"Zweden - Slowakije"},null,null,null,"-"]
["Zaterdag 12 juni 2021",null,null,null,null,null,null,null,null,null,{"$f":"+'Goede Antwoorden'!I28","v":"18:00:00"},{"$f":"+'Goede Antwoorden'!G28","v":"Glasgow"},{"$f":"+'Goede Antwoorden'!J28","v":"D"},{"$f":"VLOOKUP('Goede Antwoorden'!A28,Landnamen,2,FALSE)&\" - \"&VLOOKUP('Goede Antwoorden'!C28,Landnamen,2,FALSE)","v":"Kroatië - Tsjechië"},null,null,null,"-"]
[{"$f":"+'Goede Antwoorden'!I10","v":"15:00:00"},{"$f":"+'Goede Antwoorden'!G10","v":"Bakoe"},{"$f":"+'Goede Antwoorden'!J10","v":"A"},{"$f":"VLOOKUP('Goede Antwoorden'!A10,Landnamen,2,FALSE)&\" - \"&VLOOKUP('Goede Antwoorden'!C10,Landnamen,2,FALSE)","v":"Wales - Zwitserland"},null,null,null,"-",null,null,{"$f":"+'Goede Antwoorden'!I29","v":"21:00:00"},{"$f":"+'Goede Antwoorden'!G29","v":"Londen"},{"$f":"+'Goede Antwoorden'!J29","v":"D"},{"$f":"VLOOKUP('Goede Antwoorden'!A29,Landnamen,2,FALSE)&\" - \"&VLOOKUP('Goede Antwoorden'!C29,Landnamen,2,FALSE)","v":"Engeland - Schotland"},null,null,null,"-"]
[{"$f":"+'Goede Antwoorden'!I11","v":"18:00:00"},{"$f":"+'Goede Antwoorden'!G11","v":"Kopenhagen"},{"$f":"+'Goede Antwoorden'!J11","v":"B"},{"$f":"VLOOKUP('Goede Antwoorden'!A11,Landnamen,2,FALSE)&\" - \"&VLOOKUP('Goede Antwoorden'!C11,Landnamen,2,FALSE)","v":"Denemarken - Finland"},null,null,null,"-",null,null,"Zaterdag 19 juni 2021"]
[{"$f":"+'Goede Antwoorden'!I12","v":"21:00:00"},{"$f":"+'Goede Antwoorden'!G12","v":"Sint Petersburg"},{"$f":"+'Goede Antwoorden'!J12","v":"B"},{"$f":"VLOOKUP('Goede Antwoorden'!A12,Landnamen,2,FALSE)&\" - \"&VLOOKUP('Goede Antwoorden'!C12,Landnamen,2,FALSE)","v":"België - Rusland"},null,null,null,"-",null,null,{"$f":"+'Goede Antwoorden'!I30","v":"15:00:00"},{"$f":"+'Goede Antwoorden'!G30","v":"Boedapest"},{"$f":"+'Goede Antwoorden'!J30","v":"F"},{"$f":"VLOOKUP('Goede Antwoorden'!A30,Landnamen,2,FALSE)&\" - \"&VLOOKUP('Goede Antwoorden'!C30,Landnamen,2,FALSE)","v":"Hongarije - Frankrijk"},null,null,null,"-"]
["Zondag 13 juni 2021",null,null,null,null,null,null,null,null,null,{"$f":"+'Goede Antwoorden'!I31","v":"18:00:00"},{"$f":"+'Goede Antwoorden'!G31","v":"München"},{"$f":"+'Goede Antwoorden'!J31","v":"F"},{"$f":"VLOOKUP('Goede Antwoorden'!A31,Landnamen,2,FALSE)&\" - \"&VLOOKUP('Goede Antwoorden'!C31,Landnamen,2,FALSE)","v":"Portugal - Duitsland"},null,null,null,"-"]
[{"$f":"+'Goede Antwoorden'!I13","v":"15:00:00"},{"$f":"+'Goede Antwoorden'!G13","v":"Londen"},{"$f":"+'Goede Antwoorden'!J13","v":"D"},{"$f":"VLOOKUP('Goede Antwoorden'!A13,Landnamen,2,FALSE)&\" - \"&VLOOKUP('Goede Antwoorden'!C13,Landnamen,2,FALSE)","v":"Engeland - Kroatië"},null,null,null,"-",null,null,{"$f":"+'Goede Antwoorden'!I32","v":"21:00:00"},{"$f":"+'Goede Antwoorden'!G32","v":"Sevilla"},{"$f":"+'Goede Antwoorden'!J32","v":"E"},{"$f":"VLOOKUP('Goede Antwoorden'!A32,Landnamen,2,FALSE)&\" - \"&VLOOKUP('Goede Antwoorden'!C32,Landnamen,2,FALSE)","v":"Spanje - Polen"},null,null,null,"-"]
[{"$f":"+'Goede Antwoorden'!I14","v":"18:00:00"},{"$f":"+'Goede Antwoorden'!G14","v":"Boekarest"},{"$f":"+'Goede Antwoorden'!J14","v":"C"},{"$f":"VLOOKUP('Goede Antwoorden'!A14,Landnamen,2,FALSE)&\" - \"&VLOOKUP('Goede Antwoorden'!C14,Landnamen,2,FALSE)","v":"Oostenrijk - Noord-Macedonië"},null,null,null,"-",null,null,"Zondag 20 juni 2021"]
[{"$f":"+'Goede Antwoorden'!I15","v":"21:00:00"},{"$f":"+'Goede Antwoorden'!G15","v":"Amsterdam"},{"$f":"+'Goede Antwoorden'!J15","v":"C"},{"$f":"VLOOKUP('Goede Antwoorden'!A15,Landnamen,2,FALSE)&\" - \"&VLOOKUP('Goede Antwoorden'!C15,Landnamen,2,FALSE)","v":"Nederland - Oekraïne"},null,null,null,"-",null,null,{"$f":"+'Goede Antwoorden'!I33","v":"18:00:00"},{"$f":"+'Goede Antwoorden'!G33","v":"Rome"},{"$f":"+'Goede Antwoorden'!J33","v":"A"},{"$f":"VLOOKUP('Goede Antwoorden'!A33,Landnamen,2,FALSE)&\" - \"&VLOOKUP('Goede Antwoorden'!C33,Landnamen,2,FALSE)","v":"Italië - Wales"},null,null,null,"-"]
["Maandag 14 juni 2021",null,null,null,null,null,null,null,null,null,{"$f":"+'Goede Antwoorden'!I34","v":"18:00:00"},{"$f":"+'Goede Antwoorden'!G34","v":"Bakoe"},{"$f":"+'Goede Antwoorden'!J34","v":"A"},{"$f":"VLOOKUP('Goede Antwoorden'!A34,Landnamen,2,FALSE)&\" - \"&VLOOKUP('Goede Antwoorden'!C34,Landnamen,2,FALSE)","v":"Zwitserland - Turkije"},null,null,null,"-"]
[{"$f":"+'Goede Antwoorden'!I16","v":"15:00:00"},{"$f":"+'Goede Antwoorden'!G16","v":"Glasgow"},{"$f":"+'Goede Antwoorden'!J16","v":"D"},{"$f":"VLOOKUP('Goede Antwoorden'!A16,Landnamen,2,FALSE)&\" - \"&VLOOKUP('Goede Antwoorden'!C16,Landnamen,2,FALSE)","v":"Schotland - Tsjechië"},null,null,null,"-",null,null,"Maandag 21 juni 2021"]
[{"$f":"+'Goede Antwoorden'!I17","v":"18:00:00"},{"$f":"+'Goede Antwoorden'!G17","v":"Sint Petersburg"},{"$f":"+'Goede Antwoorden'!J17","v":"E"},{"$f":"VLOOKUP('Goede Antwoorden'!A17,Landnamen,2,FALSE)&\" - \"&VLOOKUP('Goede Antwoorden'!C17,Landnamen,2,FALSE)","v":"Polen - Slowakije"},null,null,null,"-",null,null,{"$f":"+'Goede Antwoorden'!I35","v":"18:00:00"},{"$f":"+'Goede Antwoorden'!G35","v":"Amsterdam"},{"$f":"+'Goede Antwoorden'!J35","v":"C"},{"$f":"VLOOKUP('Goede Antwoorden'!A35,Landnamen,2,FALSE)&\" - \"&VLOOKUP('Goede Antwoorden'!C35,Landnamen,2,FALSE)","v":"Noord-Macedonië - Nederland"},null,null,null,"-"]
[{"$f":"+'Goede Antwoorden'!I18","v":"21:00:00"},{"$f":"+'Goede Antwoorden'!G18","v":"Sevilla"},{"$f":"+'Goede Antwoorden'!J18","v":"E"},{"$f":"VLOOKUP('Goede Antwoorden'!A18,Landnamen,2,FALSE)&\" - \"&VLOOKUP('Goede Antwoorden'!C18,Landnamen,2,FALSE)","v":"Spanje - Zweden"},null,null,null,"-",null,null,{"$f":"+'Goede Antwoorden'!I36","v":"18:00:00"},{"$f":"+'Goede Antwoorden'!G36","v":"Boekarest"},{"$f":"+'Goede Antwoorden'!J36","v":"C"},{"$f":"VLOOKUP('Goede Antwoorden'!A36,Landnamen,2,FALSE)&\" - \"&VLOOKUP('Goede Antwoorden'!C36,Landnamen,2,FALSE)","v":"Oekraïne - Oostenrijk"},null,null,null,"-"]
["Dinsdag 15 juni 2021",null,null,null,null,null,null,null,null,null,{"$f":"+'Goede Antwoorden'!I37","v":"21:00:00"},{"$f":"+'Goede Antwoorden'!G37","v":"Kopenhagen"},{"$f":"+'Goede Antwoorden'!J37","v":"B"},{"$f":"VLOOKUP('Goede Antwoorden'!A37,Landnamen,2,FALSE)&\" - \"&VLOOKUP('Goede Antwoorden'!C37,Landnamen,2,FALSE)","v":"Rusland - Denemarken"},null,null,null,"-"]
[{"$f":"+'Goede Antwoorden'!I19","v":"18:00:00"},{"$f":"+'Goede Antwoorden'!G19","v":"Boedapest"},{"$f":"+'Goede Antwoorden'!J19","v":"F"},{"$f":"VLOOKUP('Goede Antwoorden'!A19,Landnamen,2,FALSE)&\" - \"&VLOOKUP('Goede Antwoorden'!C19,Landnamen,2,FALSE)","v":"Hongarije - Portugal"},null,null,null,"-",null,null,{"$f":"+'Goede Antwoorden'!I38","v":"21:00:00"},{"$f":"+'Goede Antwoorden'!G38","v":"Sint Petersburg"},{"$f":"+'Goede Antwoorden'!J38","v":"B"},{"$f":"VLOOKUP('Goede Antwoorden'!A38,Landnamen,2,FALSE)&\" - \"&VLOOKUP('Goede Antwoorden'!C38,Landnamen,2,FALSE)","v":"Finland - België"},null,null,null,"-"]
[{"$f":"+'Goede Antwoorden'!I20","v":"21:00:00"},{"$f":"+'Goede Antwoorden'!G20","v":"München"},{"$f":"+'Goede Antwoorden'!J20","v":"F"},{"$f":"VLOOKUP('Goede Antwoorden'!A20,Landnamen,2,FALSE)&\" - \"&VLOOKUP('Goede Antwoorden'!C20,Landnamen,2,FALSE)","v":"Frankrijk - Duitsland"},null,null,null,"-",null,null,"Dinsdag 22 juni 2021"]
["Woensdag 16 juni 2021",null,null,null,null,null,null,null,null,null,{"$f":"+'Goede Antwoorden'!I39","v":"21:00:00"},{"$f":"+'Goede Antwoorden'!G39","v":"Londen"},{"$f":"+'Goede Antwoorden'!J39","v":"D"},{"$f":"VLOOKUP('Goede Antwoorden'!A39,Landnamen,2,FALSE)&\" - \"&VLOOKUP('Goede Antwoorden'!C39,Landnamen,2,FALSE)","v":"Tsjechië - Engeland"},null,null,null,"-"]
[{"$f":"+'Goede Antwoorden'!I21","v":"15:00:00"},{"$f":"+'Goede Antwoorden'!G21","v":"Sint Petersburg"},{"$f":"+'Goede Antwoorden'!J21","v":"B"},{"$f":"VLOOKUP('Goede Antwoorden'!A21,Landnamen,2,FALSE)&\" - \"&VLOOKUP('Goede Antwoorden'!C21,Landnamen,2,FALSE)","v":"Finland - Rusland"},null,null,null,"-",null,null,{"$f":"+'Goede Antwoorden'!I40","v":"21:00:00"},{"$f":"+'Goede Antwoorden'!G40","v":"Glasgow"},{"$f":"+'Goede Antwoorden'!J40","v":"D"},{"$f":"VLOOKUP('Goede Antwoorden'!A40,Landnamen,2,FALSE)&\" - \"&VLOOKUP('Goede Antwoorden'!C40,Landnamen,2,FALSE)","v":"Kroatië - Schotland"},null,null,null,"-"]
[{"$f":"+'Goede Antwoorden'!I22","v":"18:00:00"},{"$f":"+'Goede Antwoorden'!G22","v":"Bakoe"},{"$f":"+'Goede Antwoorden'!J22","v":"A"},{"$f":"VLOOKUP('Goede Antwoorden'!A22,Landnamen,2,FALSE)&\" - \"&VLOOKUP('Goede Antwoorden'!C22,Landnamen,2,FALSE)","v":"Turkije - Wales"},null,null,null,"-",null,null,"Woensdag 23 juni 2021"]
[{"$f":"+'Goede Antwoorden'!I23","v":"21:00:00"},{"$f":"+'Goede Antwoorden'!G23","v":"Rome"},{"$f":"+'Goede Antwoorden'!J23","v":"A"},{"$f":"VLOOKUP('Goede Antwoorden'!A23,Landnamen,2,FALSE)&\" - \"&VLOOKUP('Goede Antwoorden'!C23,Landnamen,2,FALSE)","v":"Italië - Zwitserland"},null,null,null,"-",null,null,{"$f":"+'Goede Antwoorden'!I41","v":"18:00:00"},{"$f":"+'Goede Antwoorden'!G41","v":"Sevilla"},{"$f":"+'Goede Antwoorden'!J41","v":"E"},{"$f":"VLOOKUP('Goede Antwoorden'!A41,Landnamen,2,FALSE)&\" - \"&VLOOKUP('Goede Antwoorden'!C41,Landnamen,2,FALSE)","v":"Slowakije - Spanje"},null,null,null,"-"]
["Donderdag 17 juni 2021",null,null,null,null,null,null,null,null,null,{"$f":"+'Goede Antwoorden'!I42","v":"18:00:00"},{"$f":"+'Goede Antwoorden'!G42","v":"Sint Petersburg"},{"$f":"+'Goede Antwoorden'!J42","v":"E"},{"$f":"VLOOKUP('Goede Antwoorden'!A42,Landnamen,2,FALSE)&\" - \"&VLOOKUP('Goede Antwoorden'!C42,Landnamen,2,FALSE)","v":"Zweden - Polen"},null,null,null,"-"]
[{"$f":"+'Goede Antwoorden'!I24","v":"15:00:00"},{"$f":"+'Goede Antwoorden'!G24","v":"Boekarest"},{"$f":"+'Goede Antwoorden'!J24","v":"C"},{"$f":"VLOOKUP('Goede Antwoorden'!A24,Landnamen,2,FALSE)&\" - \"&VLOOKUP('Goede Antwoorden'!C24,Landnamen,2,FALSE)","v":"Oekraïne - Noord-Macedonië"},null,null,null,"-",null,null,{"$f":"+'Goede Antwoorden'!I43","v":"21:00:00"},{"$f":"+'Goede Antwoorden'!G43","v":"München"},{"$f":"+'Goede Antwoorden'!J43","v":"F"},{"$f":"VLOOKUP('Goede Antwoorden'!A43,Landnamen,2,FALSE)&\" - \"&VLOOKUP('Goede Antwoorden'!C43,Landnamen,2,FALSE)","v":"Duitsland - Hongarije"},null,null,null,"-"]
[{"$f":"+'Goede Antwoorden'!I25","v":"18:00:00"},{"$f":"+'Goede Antwoorden'!G25","v":"Kopenhagen"},{"$f":"+'Goede Antwoorden'!J25","v":"B"},{"$f":"VLOOKUP('Goede Antwoorden'!A25,Landnamen,2,FALSE)&\" - \"&VLOOKUP('Goede Antwoorden'!C25,Landnamen,2,FALSE)","v":"Denemarken - België"},null,null,null,"-",null,null,{"$f":"+'Goede Antwoorden'!I44","v":"21:00:00"},{"$f":"+'Goede Antwoorden'!G44","v":"Boedapest"},{"$f":"+'Goede Antwoorden'!J44","v":"F"},{"$f":"VLOOKUP('Goede Antwoorden'!A44,Landnamen,2,FALSE)&\" - \"&VLOOKUP('Goede Antwoorden'!C44,Landnamen,2,FALSE)","v":"Portugal - Frankrijk"},null,null,null,"-"]
[{"$f":"+'Goede Antwoorden'!I26","v":"21:00:00"},{"$f":"+'Goede Antwoorden'!G26","v":"Amsterdam"},{"$f":"+'Goede Antwoorden'!J26","v":"C"},{"$f":"VLOOKUP('Goede Antwoorden'!A26,Landnamen,2,FALSE)&\" - \"&VLOOKUP('Goede Antwoorden'!C26,Landnamen,2,FALSE)","v":"Nederland - Oostenrijk"},null,null,null,"-"]
[]
[]
["Achtste finales"]
["Zaterdag 26 juni 2021",null,null,null,null,null,null,null,null,null,"Maandag 28 juni 2021"]
[{"$f":"+'Goede Antwoorden'!Q9","v":"18:00:00"},{"$f":"+'Goede Antwoorden'!O9","v":"Amsterdam"},{"$f":"+'Goede Antwoorden'!M9","v":"A1"},"Tweede A - Tweede B",null,null,null,null,null,null,{"$f":"+'Goede Antwoorden'!Q13","v":"18:00:00"},{"$f":"+'Goede Antwoorden'!O13","v":"Kopenhagen"},{"$f":"+'Goede Antwoorden'!M13","v":"A5"},"Tweede D - Tweede E"]
[null,null,null,null,"-",null,null,null,null,null,null,null,null,null,"-"]
[{"$f":"+'Goede Antwoorden'!Q10","v":"21:00:00"},{"$f":"+'Goede Antwoorden'!O10","v":"Londen"},{"$f":"+'Goede Antwoorden'!M10","v":"A2"},"Eerste A - Tweede C",null,null,null,null,null,null,{"$f":"+'Goede Antwoorden'!Q14","v":"21:00:00"},{"$f":"+'Goede Antwoorden'!O14","v":"Boekarest"},{"$f":"+'Goede Antwoorden'!M14","v":"A6"},"Eerste F - Derde A/B/C"]
[null,null,null,null,"-",null,null,null,null,null,null,null,null,null,"-"]
["Zondag 27 juni 2021",null,null,null,null,null,null,null,null,null,"Dinsdag 29 juni 2021"]
[{"$f":"+'Goede Antwoorden'!Q11","v":"18:00:00"},{"$f":"+'Goede Antwoorden'!O11","v":"Boedapest"},{"$f":"+'Goede Antwoorden'!M11","v":"A3"},"Eerste C - Derde D/E/F",null,null,null,null,null,null,{"$f":"+'Goede Antwoorden'!Q15","v":"18:00:00"},{"$f":"+'Goede Antwoorden'!O15","v":"Londen"},{"$f":"+'Goede Antwoorden'!M15","v":"A7"},"Eerste D - Tweede F"]
[null,null,null,null,"-",null,null,null,null,null,null,null,null,null,"-"]
[{"$f":"+'Goede Antwoorden'!Q12","v":"21:00:00"},{"$f":"+'Goede Antwoorden'!O12","v":"Sevilla"},{"$f":"+'Goede Antwoorden'!M12","v":"A4"},"Eerste B - Derde A/D/E/F",null,null,null,null,null,null,{"$f":"+'Goede Antwoorden'!Q16","v":"21:00:00"},{"$f":"+'Goede Antwoorden'!O16","v":"Glasgow"},{"$f":"+'Goede Antwoorden'!M16","v":"A8"},"Eerste E - Derde A/B/C/D"]
[null,null,null,null,"-",null,null,null,null,null,null,null,null,null,"-"]
[]
["Kwartfinales"]
["Vrijdag 2 juli 2021",null,null,null,null,null,null,null,null,null,"Zaterdag 3 juli 2021"]
[{"$f":"+'Goede Antwoorden'!Q19","v":"18:00:00"},{"$f":"+'Goede Antwoorden'!O19","v":"Sint Petersburg"},{"$f":"+'Goede Antwoorden'!M19","v":"K1"},"Winnaar A6 - Winnaar A5",null,null,null,null,null,null,{"$f":"+'Goede Antwoorden'!Q21","v":"18:00:00"},{"$f":"+'Goede Antwoorden'!O21","v":"Bakoe"},{"$f":"+'Goede Antwoorden'!M21","v":"K3"},"Winnaar A3 - Winnaar A1"]
[null,null,null,null,"-",null,null,null,null,null,null,null,null,null,"-"]
[{"$f":"+'Goede Antwoorden'!Q20","v":"21:00:00"},{"$f":"+'Goede Antwoorden'!O20","v":"München"},{"$f":"+'Goede Antwoorden'!M20","v":"K2"},"Winnaar A4 - Winnaar A2",null,null,null,null,null,null,{"$f":"+'Goede Antwoorden'!Q22","v":"21:00:00"},{"$f":"+'Goede Antwoorden'!O22","v":"Rome"},{"$f":"+'Goede Antwoorden'!M22","v":"K4"},"Winnaar A8 - Winnaar A7"]
[null,null,null,null,"-",null,null,null,null,null,null,null,null,null,"-"]
[]
["Halve finales"]
["Dinsdag 6 juli 2021",null,null,null,null,null,null,null,null,null,"Woensdag 7 juli 2021"]
[{"$f":"+'Goede Antwoorden'!Q25","v":"21:00:00"},{"$f":"+'Goede Antwoorden'!O25","v":"Londen"},{"$f":"+'Goede Antwoorden'!M25","v":"H1"},"Winnaar K2 - Winnaar K1",null,null,null,null,null,null,{"$f":"+'Goede Antwoorden'!Q26","v":"21:00:00"},{"$f":"+'Goede Antwoorden'!O26","v":"Londen"},{"$f":"+'Goede Antwoorden'!M26","v":"H2"},"Winnaar K4 - Winnaar K3"]
[null,null,null,null,"-",null,null,null,null,null,null,null,null,null,"-"]
[]
["Derde plaats",null,null,null,null,null,null,null,null,null,"Finale"]
["Zondag 11 juli 2021"]
[{"$f":"+'Goede Antwoorden'!Q32","v":"21:00:00"},{"$f":"+'Goede Antwoorden'!O32","v":"Londen"},"Fin","Winaar H1 - Winnaar H2"]
[null,null,null,null,"-",null,null,null,null,null,null,null,"Winnaar Euro 2020"]

{"sheet":"Goede Antwoorden","index":1,"n_rows":59,"n_cols":26,"rows_kept":59,"cut":false,"hidden":true,"merged":[[34,11,34,13]]}
["SVO"]
["Euro 2020 Toto"]
[]
["per 28 februari 2021"]
[]
["Goede antwoorden",null,null,null,null,null,null,null,null,null,null,null,null,null,null,null,null,null,"Afkortingen",null,null,null,"Punten"]
[]
["Groepswedstrijden",null,null,null,null,null,null,null,null,null,null,"Achtste finales",null,null,null,null,null,null,"Afkorting","Volledige naam","Afkorting",null,"Groepswedstrijden"]
["Tur","-","Ita","x","y",{"$f":"IF(D9=\"x\",\"z\",IF(D9>E9,\"T\",IF(D9<E9,\"U\",\"G\")))","v":"z"},"Rome","2021-06-11","21:00:00","A",null,"2A","A1","2B","Amsterdam","2021-06-26","18:00:00",null,"Bel","België",{"$f":"+S9","v":"Bel"},null,"Doelpunt",1]
["Wal",null,"Zwi","x","y","z","Bakoe","2021-06-12","15:00:00","A",null,"1A","A2","2C","Londen","2021-06-26","21:00:00",null,"Den","Denemarken",{"$f":"+S10","v":"Den"},null,"Toto",3]
["Den",null,"Fin","x","y","z","Kopenhagen","2021-06-12","18:00:00","B",null,"1C","A3","3DEF","Boedapest","2021-06-27","18:00:00",null,"Dui","Duitsland","Dui",null,"Totaal per wedstrijd",{"$f":"+Doelpunt+Doelpunt+Toto","v":5},36,{"$f":"+X11*Y11","v":180}]
["Bel",null,"Rus","x","y","z","Sint Petersburg","2021-06-12","21:00:00","B",null,"1B","A4","3ADEF","Sevilla","2021-06-27","21:00:00",null,"Eng","Engeland","Eng",null,"Totaal doelpunten goed",10,null,{"$f":"+X12","v":10}]
["Eng",null,"Kro","x","y","z","Londen","2021-06-13","15:00:00","D",null,"2D","A5","2E","Kopenhagen","2021-06-28","18:00:00",null,"Fin","Finland","Fin",null,"Maximale score groepswedstrijden",null,null,{"$f":"SUM(Z9:Z12)","v":190}]
["Oos",null,"Mac","x","y","z","Boekarest","2021-06-13","18:00:00","C",null,"1F","A6","3ABC","Boekarest","2021-06-28","21:00:00",null,"Fra","Frankrijk","Fra"]
["Ned",null,"Oek","x","y","z","Amsterdam","2021-06-13","21:00:00","C",null,"1D","A7","2F","Londen","2021-06-29","18:00:00",null,"Hon","Hongarije","Hon",null,"Rekenmethode doelpunten verschil","B",{"$f":"IF(X15=\"A\",\"Geen extra punten bij verschil\",IF(X15=\"B\",\"Teruglopend van \"&TotaalDP&\" naar 0\",\"Eenmalig \"&TotaalBijna&\" extra punten bij maximaal \"&Afwijking&\" doelpunten verschil\"))","v":"Teruglopend van 10 naar 0"}]
["Sch",null,"Tsj","x","y","z","Glasgow","2021-06-14","15:00:00","D",null,"1E","A8","3ABCD","Glasgow","2021-06-29","21:00:00",null,"Ita","Italië","Ita",null,"Totaal doelpunten bijna goed",5]
["Pol",null,"Slw","x","y","z","Sint Petersburg","2021-06-14","18:00:00","E",null,null,null,null,null,null,null,null,"Kro","Kroatië","Kro",null,"Afwijking aantal doelpunten",5]
["Spa",null,"Zwe","x","y","z","Sevilla","2021-06-14","21:00:00","E",null,"Kwartfinales",null,null,null,null,null,null,"Ned","Nederland","Ned"]
["Hon",null,"Por","x","y","z","Boedapest","2021-06-15","18:00:00","F",null,"A6","K1","A5","Sint Petersburg","2021-07-02","18:00:00",null,"Mac","Noord-Macedonië","Mac",null,"Finalewedstrijden"]
["Fra",null,"Dui","x","y","z","München","2021-06-15","21:00:00","F",null,"A4","K2","A2","München","2021-07-02","21:00:00",null,"Oek","Oekraïne","Oek",null,"Zestiendefinalist",0,0,{"$f":"+X20*Y20","v":0}]
["Fin",null,"Rus","x","y","z","Sint Petersburg","2021-06-16","15:00:00","B",null,"A3","K3","A1","Bakoe","2021-07-03","18:00:00",null,"Oos","Oostenrijk","Oos",null,"Achtstefinalist",3,16,{"$f":"+X21*Y21","v":48}]
["Tur",null,"Wal","x","y","z","Bakoe","2021-06-16","18:00:00","A",null,"A8","K4","A7","Rome","2021-07-03","21:00:00",null,"Pol","Polen","Pol",null,"Kwartfinalist",6,8,48]
["Ita",null,"Zwi","x","y","z","Rome","2021-06-16","21:00:00","A",null,null,null,null,null,null,null,null,"Por","Portugal","Por",null,"Halve finalist",9,4,36]
["Oek",null,"Mac","x","y","z","Boekarest","2021-06-17","15:00:00","C",null,"Halve finales",null,null,null,null,null,null,"Rus","Rusland","Rus",null,"Derde plaats",0,0,0]
["Den",null,"Bel","x","y","z","Kopenhagen","2021-06-17","18:00:00","B",null,"K2","H1","K1","Londen","2021-07-06","21:00:00",null,"Sch","Schotland","Sch",null,"Finalist",14,2,28]
["Ned",null,"Oos","x","y","z","Amsterdam","2021-06-17","21:00:00","C",null,"K4","H2","K3","Londen","2021-07-07","21:00:00",null,"Slw","Slowakije","Slw",null,"Winnaar",20,1,{"$f":"+X26*Y26","v":20}]
["Zwe",null,"Slw","x","y","z","Sint Petersburg","2021-06-18","15:00:00","E",null,null,null,null,null,null,null,null,"Spa","Spanje","Spa",null,"Maximale score finalewedstrijden",null,null,{"$f":"SUM(Z21:Z26)","v":180}]
["Kro",null,"Tsj","x","y","z","Glasgow","2021-06-18","18:00:00","D",null,"Derde plaats",null,null,null,null,null,null,"Tsj","Tsjechië","Tsj"]
["Eng",null,"Sch","x","y","z","Londen","2021-06-18","21:00:00","D",null,"-","-","-","-","-","-",null,"Tur","Turkije","Tur",null,"Maximale score totaal",null,null,{"$f":"+Z13+Z27","v":370}]
["Hon",null,"Fra","x","y","z","Boedapest","2021-06-19","15:00:00","F",null,null,null,null,null,null,null,null,"Wal","Wales","Wal"]
["Por",null,"Dui","x","y",{"$f":"IF(D31=\"x\",\"z\",IF(D31>E31,\"T\",IF(D31<E31,\"U\",\"G\")))","v":"z"},"München","2021-06-19","18:00:00","F",null,"Finale",null,null,null,null,null,null,"Zwe","Zweden","Zwe",null,"Inleg"]
["Spa",null,"Pol","x","y","z","Sevilla","2021-06-19","21:00:00","E",null,"H1","F1","H2","Londen","2021-07-11","21:00:00",null,"Zwi","Zwitserland","Zwi",null,"Inleg per deelnemer",null,null,5]
["Ita",null,"Wal","x","y","z","Rome","2021-06-20","18:00:00","A"]
["Zwi",null,"Tur","x","y","z","Bakoe","2021-06-20","18:00:00","A",null,"Wereldkampioen",null,null,null,null,null,null,null,null,null,null,"Betaling"]
["Mac",null,"Ned","x","y","z","Amsterdam","2021-06-21","18:00:00","C",null,"F",null,null,null,null,null,null,null,null,null,null,"Contant betaald"]
["Oek",null,"Oos","x","y","z","Boekarest","2021-06-21","18:00:00","C",null,null,null,null,null,null,null,null,null,null,null,null,"Overgemaakt op rekening NL60 SNSB 0862 7066 02"]
["Rus",null,"Den","x","y","z","Kopenhagen","2021-06-21","21:00:00","B",null,null,null,null,null,null,null,null,null,null,null,null,"Machtiging automatische incasso van bankrekening"]
["Fin",null,"Bel","x","y","z","Sint Petersburg","2021-06-21","21:00:00","B"]
["Tsj",null,"Eng","x","y","z","Londen","2021-06-22","21:00:00","D"]
["Kro",null,"Sch","x","y","z","Glasgow","2021-06-22","21:00:00","D"]
["Slw",null,"Spa","x","y","z","Sevilla","2021-06-23","18:00:00","E"]
["Zwe",null,"Pol","x","y","z","Sint Petersburg","2021-06-23","18:00:00","E"]
["Dui",null,"Hon","x","y","z","München","2021-06-23","21:00:00","F"]
["Por",null,"Fra","x","y","z","Boedapest","2021-06-23","21:00:00","F"]
["…","-","…","x","y","z","…","2019-01-01","00:00:00","-"]
["…","-","…","x","y","z","…","2019-01-01","00:00:00","-"]
["…","-","…","x","y","z","…","2019-01-01","00:00:00","-"]
["…","-","…","x","y","z","…","2019-01-01","00:00:00","-"]
["…","-","…","x","y","z","…","2019-01-01","00:00:00","-"]
["…","-","…","x","y","z","…","2019-01-01","00:00:00","-"]
["…","-","…","x","y","z","…","2019-01-01","00:00:00","-"]
["…","-","…","x","y","z","…","2019-01-01","00:00:00","-"]
["…","-","…","x","y","z","…","2019-01-01","00:00:00","-"]
["…","-","…","x","y","z","…","2019-01-01","00:00:00","-"]
["…","-","…","x","y","z","…","2019-01-01","00:00:00","-"]
["…","-","…","x","y",{"$f":"IF(D56=\"x\",\"z\",IF(D56>E56,\"T\",IF(D56<E56,\"U\",\"G\")))","v":"z"},"…","2019-01-01","00:00:00","-"]
[]
["Totaal aantal doelpunten:",null,null,null,null,null,null,null,null,null,null,{"$f":"SUM(D9:E56)","v":0}]
["Doelpunten berekenen:",null,null,null,null,null,null,null,null,null,null,{"$f":"IF(D56=\"x\",\"nee\",\"ja\")","v":"nee"}]

{"sheet":"Export","index":2,"n_rows":4,"n_cols":184,"rows_kept":4,"cut":false,"hidden":false,"merged":[[1,101,2,101],[1,102,2,102],[1,95,2,95],[1,96,2,96],[1,97,2,97],[1,98,2,98],[1,99,2,99],[1,100,2,100],[1,94,2,94],[1,83,2,83],[1,84,2,84],[1,85,2,85],[1,86,2,86],[1,87,2,87],[1,88,2,88],[1,89,2,89],[1,90,2,90],[1,91,2,91],[1,92,2,92],[1,93,2,93],[1,82,2,82],[1,71,2,71],[1,72,2,72],[1,73,2,73],[1,74,2,74],[1,75,2,75],[1,76,2,76],[1,77,2,77],[1,78,2,78],[1,79,2,79],[1,80,2,80],[1,81,2,81],[1,70,2,70],[1,59,2,59],[1,60,2,60],[1,61,2,61],[1,62,2,62],[1,63,2,63],[1,64,2,64],[1,65,2,65],[1,66,2,66],[1,67,2,67],[1,68,2,68],[1,69,2,69],[1,58,2,58],[1,47,2,47],[1,48,2,48],[1,49,2,49],[1,50,2,50],[1,51,2,51],[1,52,2,52],[1,53,2,53],[1,54,2,54],[1,55,2,55],[1,56,2,56],[1,57,2,57],[1,46,2,46],[1,35,2,35],[1,36,2,36],[1,37,2,37],[1,38,2,38],[1,39,2,39],[1,40,2,40],[1,41,2,41],[1,42,2,42],[1,43,2,43],[1,44,2,44],[1,45,2,45],[1,34,2,34],[1,23,2,23],[1,24,2,24],[1,25,2,25],[1,26,2,26],[1,27,2,27],[1,28,2,28],[1,29,2,29],[1,30,2,30],[1,31,2,31],[1,32,2,32],[1,33,2,33],[1,22,2,22],[1,11,2,11],[1,12,2,12],[1,13,2,13],[1,14,2,14],[1,15,2,15],[1,16,2,16],[1,17,2,17],[1,18,2,18],[1,19,2,19],[1,20,2,20],[1,21,2,21],[1,10,2,10],[1,5,2,5],[1,6,2,6],[1,7,2,7],[1,8,2,8],[1,9,2,9]]}
[{"$f":"+'Goede Antwoorden'!A2","v":"Euro 2020 Toto"}]
[null,null,null,null,null,{"$f":"+'Goede Antwoorden'!$A9","v":"Tur"},{"$f":"+'Goede Antwoorden'!$C9","v":"Ita"},{"$f":"+'Goede Antwoorden'!$A10","v":"Wal"},{"$f":"+'Goede Antwoorden'!$C10","v":"Zwi"},{"$f":"+'Goede Antwoorden'!$A11","v":"Den"},{"$f":"+'Goede Antwoorden'!$C11","v":"Fin"},{"$f":"+'Goede Antwoorden'!$A12","v":"Bel"},{"$f":"+'Goede Antwoorden'!$C12","v":"Rus"},{"$f":"+'Goede Antwoorden'!$A13","v":"Eng"},{"$f":"+'Goede Antwoorden'!$C13","v":"Kro"},{"$f":"+'Goede Antwoorden'!$A14","v":"Oos"},{"$f":"+'Goede Antwoorden'!$C14","v":"Mac"},{"$f":"+'Goede Antwoorden'!$A15","v":"Ned"},{"$f":"+'Goede Antwoorden'!$C15","v":"Oek"},{"$f":"+'Goede Antwoorden'!$A16","v":"Sch"},{"$f":"+'Goede Antwoorden'!$C16","v":"Tsj"},{"$f":"+'Goede Antwoorden'!$A17","v":"Pol"},{"$f":"+'Goede Antwoorden'!$C17","v":"Slw"},{"$f":"+'Goede Antwoorden'!$A18","v":"Spa"},{"$f":"+'Goede Antwoorden'!$C18","v":"Zwe"},{"$f":"+'Goede Antwoorden'!$A19","v":"Hon"},{"$f":"+'Goede Antwoorden'!$C19","v":"Por"},{"$f":"+'Goede Antwoorden'!$A20","v":"Fra"},{"$f":"+'Goede Antwoorden'!$C20","v":"Dui"},{"$f":"+'Goede Antwoorden'!$A21","v":"Fin"},{"$f":"+'Goede Antwoorden'!$C21","v":"Rus"},{"$f":"+'Goede Antwoorden'!$A22","v":"Tur"},{"$f":"+'Goede Antwoorden'!$C22","v":"Wal"},{"$f":"+'Goede Antwoorden'!$A23","v":"Ita"},{"$f":"+'Goede Antwoorden'!$C23","v":"Zwi"},{"$f":"+'Goede Antwoorden'!$A24","v":"Oek"},{"$f":"+'Goede Antwoorden'!$C24","v":"Mac"},{"$f":"+'Goede Antwoorden'!$A25","v":"Den"},{"$f":"+'Goede Antwoorden'!$C25","v":"Bel"},{"$f":"+'Goede Antwoorden'!$A26","v":"Ned"},{"$f":"+'Goede Antwoorden'!$C26","v":"Oos"},{"$f":"+'Goede Antwoorden'!$A27","v":"Zwe"},{"$f":"+'Goede Antwoorden'!$C27","v":"Slw"},{"$f":"+'Goede Antwoorden'!$A28","v":"Kro"},{"$f":"+'Goede Antwoorden'!$C28","v":"Tsj"},{"$f":"+'Goede Antwoorden'!$A29","v":"Eng"},{"$f":"+'Goede Antwoorden'!$C29","v":"Sch"},{"$f":"+'Goede Antwoorden'!$A30","v":"Hon"},{"$f":"+'Goede Antwoorden'!$C30","v":"Fra"},{"$f":"+'Goede Antwoorden'!$A31","v":"Por"},{"$f":"+'Goede Antwoorden'!$C31","v":"Dui"},{"$f":"+'Goede Antwoorden'!$A32","v":"Spa"},{"$f":"+'Goede Antwoorden'!$C32","v":"Pol"},{"$f":"+'Goede Antwoorden'!$A33","v":"Ita"},{"$f":"+'Goede Antwoorden'!$C33","v":"Wal"},{"$f":"+'Goede Antwoorden'!$A34","v":"Zwi"},{"$f":"+'Goede Antwoorden'!$C34","v":"Tur"},{"$f":"+'Goede Antwoorden'!$A35","v":"Mac"},{"$f":"+'Goede Antwoorden'!$C35","v":"Ned"},{"$f":"+'Goede Antwoorden'!$A36","v":"Oek"},{"$f":"+'Goede Antwoorden'!$C36","v":"Oos"},{"$f":"+'Goede Antwoorden'!$A37","v":"Rus"},{"$f":"+'Goede Antwoorden'!$C37","v":"Den"},{"$f":"+'Goede Antwoorden'!$A38","v":"Fin"},{"$f":"+'Goede Antwoorden'!$C38","v":"Bel"},{"$f":"+'Goede Antwoorden'!$A39","v":"Tsj"},{"$f":"+'Goede Antwoorden'!$C39","v":"Eng"},{"$f":"+'Goede Antwoorden'!$A40","v":"Kro"},{"$f":"+'Goede Antwoorden'!$C40","v":"Sch"},{"$f":"+'Goede Antwoorden'!$A41","v":"Slw"},{"$f":"+'Goede Antwoorden'!$C41","v":"Spa"},{"$f":"+'Goede Antwoorden'!$A42","v":"Zwe"},{"$f":"+'Goede Antwoorden'!$C42","v":"Pol"},{"$f":"+'Goede Antwoorden'!$A43","v":"Dui"},{"$f":"+'Goede Antwoorden'!$C43","v":"Hon"},{"$f":"+'Goede Antwoorden'!$A44","v":"Por"},{"$f":"+'Goede Antwoorden'!$C44","v":"Fra"},{"$f":"+'Goede Antwoorden'!$A45","v":"…"},{"$f":"+'Goede Antwoorden'!$C45","v":"…"},{"$f":"+'Goede Antwoorden'!$A46","v":"…"},{"$f":"+'Goede Antwoorden'!$C46","v":"…"},{"$f":"+'Goede Antwoorden'!$A47","v":"…"},{"$f":"+'Goede Antwoorden'!$C47","v":"…"},{"$f":"+'Goede Antwoorden'!$A48","v":"…"},{"$f":"+'Goede Antwoorden'!$C48","v":"…"},{"$f":"+'Goede Antwoorden'!$A49","v":"…"},{"$f":"+'Goede Antwoorden'!$C49","v":"…"},{"$f":"+'Goede Antwoorden'!$A50","v":"…"},{"$f":"+'Goede Antwoorden'!$C50","v":"…"},{"$f":"+'Goede Antwoorden'!$A51","v":"…"},{"$f":"+'Goede Antwoorden'!$C51","v":"…"},{"$f":"+'Goede Antwoorden'!$A52","v":"…"},{"$f":"+'Goede Antwoorden'!$C52","v":"…"},{"$f":"+'Goede Antwoorden'!$A53","v":"…"},{"$f":"+'Goede Antwoorden'!$C53","v":"…"},{"$f":"+'Goede Antwoorden'!$A54","v":"…"},{"$f":"+'Goede Antwoorden'!$C54","v":"…"},{"$f":"+'Goede Antwoorden'!$A55","v":"…"},{"$f":"+'Goede Antwoorden'!$C55","v":"…"},{"$f":"+'Goede Antwoorden'!$A56","v":"…"},{"$f":"+'Goede Antwoorden'!$C56","v":"…"},"Aantal Goals","Verschil Goals",{"$f":"+'Goede Antwoorden'!$A9","v":"Tur"},{"$f":"+'Goede Antwoorden'!$A10","v":"Wal"},{"$f":"+'Goede Antwoorden'!$A11","v":"Den"},{"$f":"+'Goede Antwoorden'!$A12","v":"Bel"},{"$f":"+'Goede Antwoorden'!$A13","v":"Eng"},{"$f":"+'Goede Antwoorden'!$A14","v":"Oos"},{"$f":"+'Goede Antwoorden'!$A15","v":"Ned"},{"$f":"+'Goede Antwoorden'!$A16","v":"Sch"},{"$f":"+'Goede Antwoorden'!$A17","v":"Pol"},{"$f":"+'Goede Antwoorden'!$A18","v":"Spa"},{"$f":"+'Goede Antwoorden'!$A19","v":"Hon"},{"$f":"+'Goede Antwoorden'!$A20","v":"Fra"},{"$f":"+'Goede Antwoorden'!$A21","v":"Fin"},{"$f":"+'Goede Antwoorden'!$A22","v":"Tur"},{"$f":"+'Goede Antwoorden'!$A23","v":"Ita"},{"$f":"+'Goede Antwoorden'!$A24","v":"Oek"},{"$f":"+'Goede Antwoorden'!$A25","v":"Den"},{"$f":"+'Goede Antwoorden'!$A26","v":"Ned"},{"$f":"+'Goede Antwoorden'!$A27","v":"Zwe"},{"$f":"+'Goede Antwoorden'!$A28","v":"Kro"},{"$f":"+'Goede Antwoorden'!$A29","v":"Eng"},{"$f":"+'Goede Antwoorden'!$A30","v":"Hon"},{"$f":"+'Goede Antwoorden'!$A31","v":"Por"},{"$f":"+'Goede Antwoorden'!$A32","v":"Spa"},{"$f":"+'Goede Antwoorden'!$A33","v":"Ita"},{"$f":"+'Goede Antwoorden'!$A34","v":"Zwi"},{"$f":"+'Goede Antwoorden'!$A35","v":"Mac"},{"$f":"+'Goede Antwoorden'!$A36","v":"Oek"},{"$f":"+'Goede Antwoorden'!$A37","v":"Rus"},{"$f":"+'Goede Antwoorden'!$A38","v":"Fin"},{"$f":"+'Goede Antwoorden'!$A39","v":"Tsj"},{"$f":"+'Goede Antwoorden'!$A40","v":"Kro"},{"$f":"+'Goede Antwoorden'!$A41","v":"Slw"},{"$f":"+'Goede Antwoorden'!$A42","v":"Zwe"},{"$f":"+'Goede Antwoorden'!$A43","v":"Dui"},{"$f":"+'Goede Antwoorden'!$A44","v":"Por"},{"$f":"+'Goede Antwoorden'!$A45","v":"…"},{"$f":"+'Goede Antwoorden'!$A46","v":"…"},{"$f":"+'Goede Antwoorden'!$A47","v":"…"},{"$f":"+'Goede Antwoorden'!$A48","v":"…"},{"$f":"+'Goede Antwoorden'!$A49","v":"…"},{"$f":"+'Goede Antwoorden'!$A50","v":"…"},{"$f":"+'Goede Antwoorden'!$A51","v":"…"},{"$f":"+'Goede Antwoorden'!$A52","v":"…"},{"$f":"+'Goede Antwoorden'!$A53","v":"…"},{"$f":"+'Goede Antwoorden'!$A54","v":"…"},{"$f":"+'Goede Antwoorden'!$A55","v":"…"},{"$f":"+'Goede Antwoorden'!$A56","v":"…"}]
["Naam",null,"Formuliernummer","Telefoon","E-mail",null,null,null,null,null,null,null,null,null,null,null,null,null,null,null,null,null,null,null,null,null,null,null,null,null,null,null,null,null,null,null,null,null,null,null,null,null,null,null,null,null,null,null,null,null,null,null,null,null,null,null,null,null,null,null,null,null,null,null,null,null,null,null,null,null,null,null,null,null,null,null,null,null,null,null,null,null,null,null,null,null,null,null,null,null,null,null,null,null,null,null,null,null,null,null,null,null,null,{"$f":"+'Goede Antwoorden'!$C9","v":"Ita"},{"$f":"+'Goede Antwoorden'!$C10","v":"Zwi"},{"$f":"+'Goede Antwoorden'!$C11","v":"Fin"},{"$f":"+'Goede Antwoorden'!$C12","v":"Rus"},{"$f":"+'Goede Antwoorden'!$C13","v":"Kro"},{"$f":"+'Goede Antwoorden'!$C14","v":"Mac"},{"$f":"+'Goede Antwoorden'!$C15","v":"Oek"},{"$f":"+'Goede Antwoorden'!$C16","v":"Tsj"},{"$f":"+'Goede Antwoorden'!$C17","v":"Slw"},{"$f":"+'Goede Antwoorden'!$C18","v":"Zwe"},{"$f":"+'Goede Antwoorden'!$C19","v":"Por"},{"$f":"+'Goede Antwoorden'!$C20","v":"Dui"},{"$f":"+'Goede Antwoorden'!$C21","v":"Rus"},{"$f":"+'Goede Antwoorden'!$C22","v":"Wal"},{"$f":"+'Goede Antwoorden'!$C23","v":"Zwi"},{"$f":"+'Goede Antwoorden'!$C24","v":"Mac"},{"$f":"+'Goede Antwoorden'!$C25","v":"Bel"},{"$f":"+'Goede Antwoorden'!$C26","v":"Oos"},{"$f":"+'Goede Antwoorden'!$C27","v":"Slw"},{"$f":"+'Goede Antwoorden'!$C28","v":"Tsj"},{"$f":"+'Goede Antwoorden'!$C29","v":"Sch"},{"$f":"+'Goede Antwoorden'!$C30","v":"Fra"},{"$f":"+'Goede Antwoorden'!$C31","v":"Dui"},{"$f":"+'Goede Antwoorden'!$C32","v":"Pol"},{"$f":"+'Goede Antwoorden'!$C33","v":"Wal"},{"$f":"+'Goede Antwoorden'!$C34","v":"Tur"},{"$f":"+'Goede Antwoorden'!$C35","v":"Ned"},{"$f":"+'Goede Antwoorden'!$C36","v":"Oos"},{"$f":"+'Goede Antwoorden'!$C37","v":"Den"},{"$f":"+'Goede Antwoorden'!$C38","v":"Bel"},{"$f":"+'Goede Antwoorden'!$C39","v":"Eng"},{"$f":"+'Goede Antwoorden'!$C40","v":"Sch"},{"$f":"+'Goede Antwoorden'!$C41","v":"Spa"},{"$f":"+'Goede Antwoorden'!$C42","v":"Pol"},{"$f":"+'Goede Antwoorden'!$C43","v":"Hon"},{"$f":"+'Goede Antwoorden'!$C44","v":"Fra"},{"$f":"+'Goede Antwoorden'!$C45","v":"…"},{"$f":"+'Goede Antwoorden'!$C46","v":"…"},{"$f":"+'Goede Antwoorden'!$C47","v":"…"},{"$f":"+'Goede Antwoorden'!$C48","v":"…"},{"$f":"+'Goede Antwoorden'!$C49","v":"…"},{"$f":"+'Goede Antwoorden'!$C50","v":"…"},{"$f":"+'Goede Antwoorden'!$C51","v":"…"},{"$f":"+'Goede Antwoorden'!$C52","v":"…"},{"$f":"+'Goede Antwoorden'!$C53","v":"…"},{"$f":"+'Goede Antwoorden'!$C54","v":"…"},{"$f":"+'Goede Antwoorden'!$C55","v":"…"},{"$f":"+'Goede Antwoorden'!$C56","v":"…"},"Achtste finalisten",null,null,null,null,null,null,null,null,null,null,null,null,null,null,null,"Kwartfinalisten",null,null,null,null,null,null,null,"Halve finalisten",null,null,null,"3e plaats",null,"Finale",null,"Winnaar"]
[{"$f":"+Formulier!D6","v":" "},null,null,{"$f":"+Formulier!D7","v":0},{"$f":"+Formulier!D8","v":0},{"$f":"+Formulier!G13","v":0},{"$f":"+Formulier!I13","v":0},{"$f":"+Formulier!G15","v":0},{"$f":"+Formulier!I15","v":0},{"$f":"+Formulier!G16","v":0},{"$f":"+Formulier!I16","v":0},{"$f":"+Formulier!G17","v":0},{"$f":"+Formulier!I17","v":0},{"$f":"+Formulier!G19","v":0},{"$f":"+Formulier!I19","v":0},{"$f":"+Formulier!G20","v":0},{"$f":"+Formulier!I20","v":0},{"$f":"+Formulier!G21","v":0},{"$f":"+Formulier!I21","v":0},{"$f":"+Formulier!G23","v":0},{"$f":"+Formulier!I23","v":0},{"$f":"+Formulier!G24","v":0},{"$f":"+Formulier!I24","v":0},{"$f":"+Formulier!G25","v":0},{"$f":"+Formulier!I25","v":0},{"$f":"+Formulier!G27","v":0},{"$f":"+Formulier!I27","v":0},{"$f":"+Formulier!G28","v":0},{"$f":"+Formulier!I28","v":0},{"$f":"+Formulier!G30","v":0},{"$f":"+Formulier!I30","v":0},{"$f":"+Formulier!G31","v":0},{"$f":"+Formulier!I31","v":0},{"$f":"+Formulier!G32","v":0},{"$f":"+Formulier!I32","v":0},{"$f":"+Formulier!G34","v":0},{"$f":"+Formulier!I34","v":0},{"$f":"+Formulier!G35","v":0},{"$f":"+Formulier!I35","v":0},{"$f":"+Formulier!G36","v":0},{"$f":"+Formulier!I36","v":0},{"$f":"+Formulier!Q13","v":0},{"$f":"+Formulier!S13","v":0},{"$f":"+Formulier!Q14","v":0},{"$f":"+Formulier!S14","v":0},{"$f":"+Formulier!Q15","v":0},{"$f":"+Formulier!S15","v":0},{"$f":"+Formulier!Q17","v":0},{"$f":"+Formulier!S17","v":0},{"$f":"+Formulier!Q18","v":0},{"$f":"+Formulier!S18","v":0},{"$f":"+Formulier!Q19","v":0},{"$f":"+Formulier!S19","v":0},{"$f":"+Formulier!Q21","v":0},{"$f":"+Formulier!S21","v":0},{"$f":"+Formulier!Q22","v":0},{"$f":"+Formulier!S22","v":0},{"$f":"+Formulier!Q24","v":0},{"$f":"+Formulier!S24","v":0},{"$f":"+Formulier!Q25","v":0},{"$f":"+Formulier!S25","v":0},{"$f":"+Formulier!Q26","v":0},{"$f":"+Formulier!S26","v":0},{"$f":"+Formulier!Q27","v":0},{"$f":"+Formulier!S27","v":0},{"$f":"+Formulier!Q29","v":0},{"$f":"+Formulier!S29","v":0},{"$f":"+Formulier!Q30","v":0},{"$f":"+Formulier!S30","v":0},{"$f":"+Formulier!Q32","v":0},{"$f":"+Formulier!S32","v":0},{"$f":"+Formulier!Q33","v":0},{"$f":"+Formulier!S33","v":0},{"$f":"+Formulier!Q34","v":0},{"$f":"+Formulier!S34","v":0},{"$f":"+Formulier!Q35","v":0},{"$f":"+Formulier!S35","v":0},null,null,null,null,null,null,null,null,null,null,null,null,null,null,null,null,null,null,null,null,null,null,null,null,{"$f":"IF(#REF!=\"\",\"\",SUM(F4:CW4))","v":{"$error":"#REF!"}},{"$f":"IF(CX4=\"\",\"\",ABS(CX4-#REF!))","v":{"$error":"#REF!"}},{"$f":"IF(#REF!=\"\",\"0\",IF(#REF!>#REF!,\"T\",IF(#REF!<#REF!,\"U\",\"G\")))","v":{"$error":"#REF!"}},{"$f":"IF(#REF!=\"\",\"0\",IF(#REF!>#REF!,\"T\",IF(#REF!<#REF!,\"U\",\"G\")))","v":{"$error":"#REF!"}},{"$f":"IF(#REF!=\"\",\"0\",IF(#REF!>#REF!,\"T\",IF(#REF!<#REF!,\"U\",\"G\")))","v":{"$error":"#REF!"}},{"$f":"IF(#REF!=\"\",\"0\",IF(#REF!>#REF!,\"T\",IF(#REF!<#REF!,\"U\",\"G\")))","v":{"$error":"#REF!"}},{"$f":"IF(#REF!=\"\",\"0\",IF(#REF!>#REF!,\"T\",IF(#REF!<#REF!,\"U\",\"G\")))","v":{"$error":"#REF!"}},{"$f":"IF(#REF!=\"\",\"0\",IF(#REF!>#REF!,\"T\",IF(#REF!<#REF!,\"U\",\"G\")))","v":{"$error":"#REF!"}},{"$f":"IF(#REF!=\"\",\"0\",IF(#REF!>#REF!,\"T\",IF(#REF!<#REF!,\"U\",\"G\")))","v":{"$error":"#REF!"}},{"$f":"IF(#REF!=\"\",\"0\",IF(#REF!>#REF!,\"T\",IF(#REF!<#REF!,\"U\",\"G\")))","v":{"$error":"#REF!"}},{"$f":"IF(#REF!=\"\",\"0\",IF(#REF!>#REF!,\"T\",IF(#REF!<#REF!,\"U\",\"G\")))","v":{"$error":"#REF!"}},{"$f":"IF(#REF!=\"\",\"0\",IF(#REF!>#REF!,\"T\",IF(#REF!<#REF!,\"U\",\"G\")))","v":{"$error":"#REF!"}},{"$f":"IF(#REF!=\"\",\"0\",IF(#REF!>#REF!,\"T\",IF(#REF!<#REF!,\"U\",\"G\")))","v":{"$error":"#REF!"}},{"$f":"IF(#REF!=\"\",\"0\",IF(#REF!>#REF!,\"T\",IF(#REF!<#REF!,\"U\",\"G\")))","v":{"$error":"#REF!"}},{"$f":"IF(#REF!=\"\",\"0\",IF(#REF!>#REF!,\"T\",IF(#REF!<#REF!,\"U\",\"G\")))","v":{"$error":"#REF!"}},{"$f":"IF(#REF!=\"\",\"0\",IF(#REF!>#REF!,\"T\",IF(#REF!<#REF!,\"U\",\"G\")))","v":{"$error":"#REF!"}},{"$f":"IF(#REF!=\"\",\"0\",IF(#REF!>#REF!,\"T\",IF(#REF!<#REF!,\"U\",\"G\")))","v":{"$error":"#REF!"}},{"$f":"IF(#REF!=\"\",\"0\",IF(#REF!>#REF!,\"T\",IF(#REF!<#REF!,\"U\",\"G\")))","v":{"$error":"#REF!"}},{"$f":"IF(#REF!=\"\",\"0\",IF(#REF!>#REF!,\"T\",IF(#REF!<#REF!,\"U\",\"G\")))","v":{"$error":"#REF!"}},{"$f":"IF(#REF!=\"\",\"0\",IF(#REF!>#REF!,\"T\",IF(#REF!<#REF!,\"U\",\"G\")))","v":{"$error":"#REF!"}},{"$f":"IF(#REF!=\"\",\"0\",IF(#REF!>#REF!,\"T\",IF(#REF!<#REF!,\"U\",\"G\")))","v":{"$error":"#REF!"}},{"$f":"IF(#REF!=\"\",\"0\",IF(#REF!>#REF!,\"T\",IF(#REF!<#REF!,\"U\",\"G\")))","v":{"$error":"#REF!"}},{"$f":"IF(#REF!=\"\",\"0\",IF(#REF!>#REF!,\"T\",IF(#REF!<#REF!,\"U\",\"G\")))","v":{"$error":"#REF!"}},{"$f":"IF(#REF!=\"\",\"0\",IF(#REF!>#REF!,\"T\",IF(#REF!<#REF!,\"U\",\"G\")))","v":{"$error":"#REF!"}},{"$f":"IF(#REF!=\"\",\"0\",IF(#REF!>#REF!,\"T\",IF(#REF!<#REF!,\"U\",\"G\")))","v":{"$error":"#REF!"}},{"$f":"IF(#REF!=\"\",\"0\",IF(#REF!>#REF!,\"T\",IF(#REF!<#REF!,\"U\",\"G\")))","v":{"$error":"#REF!"}},{"$f":"IF(#REF!=\"\",\"0\",IF(#REF!>#REF!,\"T\",IF(#REF!<#REF!,\"U\",\"G\")))","v":{"$error":"#REF!"}},{"$f":"IF(#REF!=\"\",\"0\",IF(#REF!>#REF!,\"T\",IF(#REF!<#REF!,\"U\",\"G\")))","v":{"$error":"#REF!"}},{"$f":"IF(#REF!=\"\",\"0\",IF(#REF!>#REF!,\"T\",IF(#REF!<#REF!,\"U\",\"G\")))","v":{"$error":"#REF!"}},{"$f":"IF(#REF!=\"\",\"0\",IF(#REF!>#REF!,\"T\",IF(#REF!<#REF!,\"U\",\"G\")))","v":{"$error":"#REF!"}},{"$f":"IF(#REF!=\"\",\"0\",IF(#REF!>#REF!,\"T\",IF(#REF!<#REF!,\"U\",\"G\")))","v":{"$error":"#REF!"}},{"$f":"IF(#REF!=\"\",\"0\",IF(#REF!>#REF!,\"T\",IF(#REF!<#REF!,\"U\",\"G\")))","v":{"$error":"#REF!"}},{"$f":"IF(#REF!=\"\",\"0\",IF(#REF!>#REF!,\"T\",IF(#REF!<#REF!,\"U\",\"G\")))","v":{"$error":"#REF!"}},{"$f":"IF(#REF!=\"\",\"0\",IF(#REF!>#REF!,\"T\",IF(#REF!<#REF!,\"U\",\"G\")))","v":{"$error":"#REF!"}},{"$f":"IF(#REF!=\"\",\"0\",IF(#REF!>#REF!,\"T\",IF(#REF!<#REF!,\"U\",\"G\")))","v":{"$error":"#REF!"}},{"$f":"IF(#REF!=\"\",\"0\",IF(#REF!>#REF!,\"T\",IF(#REF!<#REF!,\"U\",\"G\")))","v":{"$error":"#REF!"}},{"$f":"IF(#REF!=\"\",\"0\",IF(#REF!>#REF!,\"T\",IF(#REF!<#REF!,\"U\",\"G\")))","v":{"$error":"#REF!"}},{"$f":"IF(#REF!=\"\",\"0\",IF(#REF!>#REF!,\"T\",IF(#REF!<#REF!,\"U\",\"G\")))","v":{"$error":"#REF!"}},{"$f":"IF(BZ4=\"\",\"0\",IF(BZ4>CA4,\"T\",IF(BZ4<CA4,\"U\",\"G\")))","v":"0"},{"$f":"IF(CB4=\"\",\"0\",IF(CB4>CC4,\"T\",IF(CB4<CC4,\"U\",\"G\")))","v":"0"},{"$f":"IF(CD4=\"\",\"0\",IF(CD4>CE4,\"T\",IF(CD4<CE4,\"U\",\"G\")))","v":"0"},{"$f":"IF(CF4=\"\",\"0\",IF(CF4>CG4,\"T\",IF(CF4<CG4,\"U\",\"G\")))","v":"0"},{"$f":"IF(CH4=\"\",\"0\",IF(CH4>CI4,\"T\",IF(CH4<CI4,\"U\",\"G\")))","v":"0"},{"$f":"IF(CJ4=\"\",\"0\",IF(CJ4>CK4,\"T\",IF(CJ4<CK4,\"U\",\"G\")))","v":"0"},{"$f":"IF(CL4=\"\",\"0\",IF(CL4>CM4,\"T\",IF(CL4<CM4,\"U\",\"G\")))","v":"0"},{"$f":"IF(CN4=\"\",\"0\",IF(CN4>CO4,\"T\",IF(CN4<CO4,\"U\",\"G\")))","v":"0"},{"$f":"IF(CP4=\"\",\"0\",IF(CP4>CQ4,\"T\",IF(CP4<CQ4,\"U\",\"G\")))","v":"0"},{"$f":"IF(CR4=\"\",\"0\",IF(CR4>CS4,\"T\",IF(CR4<CS4,\"U\",\"G\")))","v":"0"},{"$f":"IF(CT4=\"\",\"0\",IF(CT4>CU4,\"T\",IF(CT4<CU4,\"U\",\"G\")))","v":"0"},{"$f":"IF(CV4=\"\",\"0\",IF(CV4>CW4,\"T\",IF(CV4<CW4,\"U\",\"G\")))","v":"0"},{"$f":"VLOOKUP(Formulier!D42,Afkorting,2,FALSE)","v":{"$error":"#N/A"}},{"$f":"VLOOKUP(Formulier!F42,Afkorting,2,FALSE)","v":{"$error":"#N/A"}},{"$f":"VLOOKUP(Formulier!D44,Afkorting,2,FALSE)","v":{"$error":"#N/A"}},{"$f":"VLOOKUP(Formulier!F44,Afkorting,2,FALSE)","v":{"$error":"#N/A"}},{"$f":"VLOOKUP(Formulier!D47,Afkorting,2,FALSE)","v":{"$error":"#N/A"}},{"$f":"VLOOKUP(Formulier!F47,Afkorting,2,FALSE)","v":{"$error":"#N/A"}},{"$f":"VLOOKUP(Formulier!D49,Afkorting,2,FALSE)","v":{"$error":"#N/A"}},{"$f":"VLOOKUP(Formulier!F49,Afkorting,2,FALSE)","v":{"$error":"#N/A"}},{"$f":"VLOOKUP(Formulier!N42,Afkorting,2,FALSE)","v":{"$error":"#N/A"}},{"$f":"VLOOKUP(Formulier!P42,Afkorting,2,FALSE)","v":{"$error":"#N/A"}},{"$f":"VLOOKUP(Formulier!N44,Afkorting,2,FALSE)","v":{"$error":"#N/A"}},{"$f":"VLOOKUP(Formulier!P44,Afkorting,2,FALSE)","v":{"$error":"#N/A"}},{"$f":"VLOOKUP(Formulier!N47,Afkorting,2,FALSE)","v":{"$error":"#N/A"}},{"$f":"VLOOKUP(Formulier!P47,Afkorting,2,FALSE)","v":{"$error":"#N/A"}},{"$f":"VLOOKUP(Formulier!N49,Afkorting,2,FALSE)","v":{"$error":"#N/A"}},{"$f":"VLOOKUP(Formulier!P49,Afkorting,2,FALSE)","v":{"$error":"#N/A"}},{"$f":"VLOOKUP(Formulier!D54,Afkorting,2,FALSE)","v":{"$error":"#N/A"}},{"$f":"VLOOKUP(Formulier!F54,Afkorting,2,FALSE)","v":{"$error":"#N/A"}},{"$f":"VLOOKUP(Formulier!D56,Afkorting,2,FALSE)","v":{"$error":"#N/A"}},{"$f":"VLOOKUP(Formulier!F56,Afkorting,2,FALSE)","v":{"$error":"#N/A"}},{"$f":"VLOOKUP(Formulier!N54,Afkorting,2,FALSE)","v":{"$error":"#N/A"}},{"$f":"VLOOKUP(Formulier!P54,Afkorting,2,FALSE)","v":{"$error":"#N/A"}},{"$f":"VLOOKUP(Formulier!N56,Afkorting,2,FALSE)","v":{"$error":"#N/A"}},{"$f":"VLOOKUP(Formulier!P56,Afkorting,2,FALSE)","v":{"$error":"#N/A"}},{"$f":"VLOOKUP(Formulier!D61,Afkorting,2,FALSE)","v":{"$error":"#N/A"}},{"$f":"VLOOKUP(Formulier!F61,Afkorting,2,FALSE)","v":{"$error":"#N/A"}},{"$f":"VLOOKUP(Formulier!N61,Afkorting,2,FALSE)","v":{"$error":"#N/A"}},{"$f":"VLOOKUP(Formulier!P61,Afkorting,2,FALSE)","v":{"$error":"#N/A"}},null,null,{"$f":"VLOOKUP(Formulier!D66,Afkorting,2,FALSE)","v":{"$error":"#N/A"}},{"$f":"VLOOKUP(Formulier!F66,Afkorting,2,FALSE)","v":{"$error":"#N/A"}},{"$f":"VLOOKUP(Formulier!N66,Afkorting,2,FALSE)","v":{"$error":"#N/A"}}]